BDBM50200632 4-(6-(2-(ethyl(isopropyl)amino)ethyl)naphthalen-2-yl)benzonitrile::CHEMBL395131
SMILES CCN(CCc1ccc2cc(ccc2c1)-c1ccc(cc1)C#N)C(C)C
InChI Key InChIKey=NFNZDEVHQMJVQK-UHFFFAOYSA-N
Data  2 KI
  Tab Delimited (TSV)   2D SDfile   Computed 3D by Vconf -m prep SDfile
Find this compound or compounds like it in BindingDB:
Activity Spreadsheet -- Enzyme Inhibition Constant Data from BindingDB
Found 2 hits for monomerid = 50200632
TargetHistamine H3 receptor(Homo sapiens (Human))
Abbott Laboratories
Curated by ChEMBL
LigandPNGBDBM50200632(4-(6-(2-(ethyl(isopropyl)amino)ethyl)naphthalen-2-...)
Affinity DataKi:  4.62nM. Assay description: Displacement of [3H]-N-alpha-methylhistamine from human cloned histamine H3 receptor expressed in C6 cells
In DepthDetails ArticlePubMed
TargetHistamine H3 receptor(Rattus norvegicus (rat))
Abbott Laboratories
Curated by ChEMBL
LigandPNGBDBM50200632(4-(6-(2-(ethyl(isopropyl)amino)ethyl)naphthalen-2-...)
Affinity DataKi:  30.3nM. Assay description: Displacement of [3H]-N-alpha-methylhistamine from histamine H3 receptor in rat cortical membranes
In DepthDetails ArticlePubMed