BDBM502035 2-Isobutyl-8-(2- ((methyl(2-(methyl- amino)ethyl)amino)- methyl)-6,7-dihydro- 4H-pyrazolo[5,1-c]- [1,4]oxazin-3-yl)-2- azaspiro[4.5]decan-1- one::US11028083, Example 29
SMILES CNCCN(C)Cc1nn2CCOCc2c1C1CCC2(CCN(CC(C)C)C2=O)CC1
InChI Key InChIKey=XDMUSCHBFUUPQR-UHFFFAOYSA-N
Data  1 IC50
  Tab Delimited (TSV)   2D SDfile   Computed 3D by Vconf -m prep SDfile
Find this compound or compounds like it in BindingDB:
Activity Spreadsheet -- Enzyme Inhibition Constant Data from BindingDB
Found 1 hit for monomerid = 502035
TargetProtein arginine N-methyltransferase 1(Homo sapiens)
Board Of Regents, The University Of Texas System
US Patent
LigandPNGBDBM502035(2-Isobutyl-8-(2- ((methyl(2-(methyl- amino)ethyl)a...)
Affinity DataIC50:  87nM. Assay description: This enzymatic assay was performed in a 384 well, white, low volume plate (PerkinElmer, Catalog 6008289) with assay buffer consisting of 50 mM Hepes ...
Ligand InfoPC cidPC sid
In DepthDetails US Patent