BDBM502038 N1-((3-(4,4-bis(ethoxy- methyl)cyclohexyl)- 5,6,7,8-tetrahydro- imidazo[1,2-a]pyridin- 2-yl)methyl)-N1,N2- dimethylethane-1,2- diamine::US11028083, Example 32
SMILES CCOCC1(COCC)CCC(CC1)c1c(CN(C)CCNC)nc2CCOCn12
InChI Key InChIKey=RRAWNDQDOLKHMM-UHFFFAOYSA-N
Data  1 IC50
  Tab Delimited (TSV)   2D SDfile   Computed 3D by Vconf -m prep SDfile
Find this compound or compounds like it in BindingDB:
Activity Spreadsheet -- Enzyme Inhibition Constant Data from BindingDB
Found 1 hit for monomerid = 502038
TargetProtein arginine N-methyltransferase 1(Homo sapiens)
Board Of Regents, The University Of Texas System
US Patent
LigandPNGBDBM502038(N1-((3-(4,4-bis(ethoxy- methyl)cyclohexyl)- 5,6,7,...)
Affinity DataIC50:  43nM. Assay description: This enzymatic assay was performed in a 384 well, white, low volume plate (PerkinElmer, Catalog 6008289) with assay buffer consisting of 50 mM Hepes ...
Ligand InfoPC cidPC sid
In DepthDetails US Patent