BDBM502044 2-Ethyl-8-(2-((methyl- (2-(methylamino)- ethyl)amino)methyl)- 6,7-dihydro-4H- pyrazolo[5,1-c][1,4]- oxazin-3-yl)-2-aza- spiro[4.5]decan-1-one::US11028083, Example 38
SMILES CCN1CCC2(CCC(CC2)c2c(CN(C)CCNC)nn3CCOCc23)C1=O
InChI Key InChIKey=DOIDYAZUDLVRNU-UHFFFAOYSA-N
Data  1 IC50
  Tab Delimited (TSV)   2D SDfile   Computed 3D by Vconf -m prep SDfile
Find this compound or compounds like it in BindingDB:
Activity Spreadsheet -- Enzyme Inhibition Constant Data from BindingDB
Found 1 hit for monomerid = 502044
TargetProtein arginine N-methyltransferase 1(Homo sapiens)
Board Of Regents, The University Of Texas System
US Patent
LigandPNGBDBM502044(2-Ethyl-8-(2-((methyl- (2-(methylamino)- ethyl)ami...)
Affinity DataIC50:  168nM. Assay description: This enzymatic assay was performed in a 384 well, white, low volume plate (PerkinElmer, Catalog 6008289) with assay buffer consisting of 50 mM Hepes ...
Ligand InfoPC cidPC sid
In DepthDetails US Patent