BDBM50205802 2-(4-fluorophenethyl)-5-(4-fluorophenylsulfonyl)pyridine::CHEMBL240839
SMILES Fc1ccc(CCc2ccc(cn2)S(=O)(=O)c2ccc(F)cc2)cc1
InChI Key InChIKey=STAZSACUQPAKDP-UHFFFAOYSA-N
Data  4 KI
  Tab Delimited (TSV)   2D SDfile   Computed 3D by Vconf -m prep SDfile
Find this compound or compounds like it in BindingDB:
Activity Spreadsheet -- Enzyme Inhibition Constant Data from BindingDB
Found 4 hits for monomerid = 50205802
Target5-hydroxytryptamine receptor 2A(Homo sapiens (Human))
Merck Sharp And Dohme Research Laboratories
Curated by ChEMBL
LigandPNGBDBM50205802(2-(4-fluorophenethyl)-5-(4-fluorophenylsulfonyl)py...)
Affinity DataKi:  23nM. Assay description: Displacement of [3H]ketanserin from human 5HT2A receptor expressed in CHO cells
In DepthDetails ArticlePubMed
TargetD(2) dopamine receptor(Homo sapiens (Human))
Merck Sharp And Dohme Research Laboratories
Curated by ChEMBL
LigandPNGBDBM50205802(2-(4-fluorophenethyl)-5-(4-fluorophenylsulfonyl)py...)
Affinity DataKi: >1.00E+3nM. Assay description: Displacement of [3H]spiperone from human dopamine D2 receptor expressed in CHO cells
In DepthDetails ArticlePubMed
Target5-hydroxytryptamine receptor 2C(Homo sapiens (Human))
Merck Sharp And Dohme Research Laboratories
Curated by ChEMBL
LigandPNGBDBM50205802(2-(4-fluorophenethyl)-5-(4-fluorophenylsulfonyl)py...)
Affinity DataKi:  2.70E+3nM. Assay description: Displacement of [3H]mesurgeline from human 5HT2C receptor expressed in CHO cells
In DepthDetails ArticlePubMed
TargetPotassium voltage-gated channel subfamily H member 2(Homo sapiens (Human))
Merck Sharp And Dohme Research Laboratories
Curated by ChEMBL
LigandPNGBDBM50205802(2-(4-fluorophenethyl)-5-(4-fluorophenylsulfonyl)py...)
Affinity DataKi:  8.20E+3nM. Assay description: Displacement of [3H]dofetilide from hERG expressed in HEK cells
In DepthDetails ArticlePubMed