BDBM50206443 2-((4-(dimethylamino)phenyl)diazenyl)benzoic acid::2-(4-DIMETHYLAMINOPHENYL)DIAZENYLBENZOIC ACID::CHEMBL375971
SMILES CN(C)c1ccc(cc1)\N=N\c1ccccc1C(O)=O
InChI Key InChIKey=CEQFOVLGLXCDCX-WUKNDPDISA-N
Data  2 IC50
PDB links: 2 PDB IDs match this monomer.
  Tab Delimited (TSV)   2D SDfile   Computed 3D by Vconf -m prep SDfile
Find this compound or compounds like it in BindingDB:
Activity Spreadsheet -- Enzyme Inhibition Constant Data from BindingDB
Found 2 hits for monomerid = 50206443
TargetRmtA(Emericella nidulans)
Sapienza University Of Rome
Curated by ChEMBL
LigandPNGBDBM50206443(2-((4-(dimethylamino)phenyl)diazenyl)benzoic acid ...)
Affinity DataIC50:  2.10E+6nM. Assay description: Inhibition of Aspergillus nidulans recombinant GST-RmtA expressed in BL21 cells
In DepthDetails ArticlePubMed
TargetProtein arginine N-methyltransferase 1 [11-371](Homo sapiens (Human))
Sapienza University Of Rome
Curated by ChEMBL
LigandPNGBDBM50206443(2-((4-(dimethylamino)phenyl)diazenyl)benzoic acid ...)
Affinity DataIC50:  4.40E+5nM. Assay description: Inhibition of human recombinant GST-PRMT1 expressed in BL21 cells
In DepthDetails ArticlePubMed