BDBM502079 US11028083, Example 67b
SMILES CNCCN(C)Cc1nn2CC(F)(F)Cc2c1[C@H]1CCC2(CCN(Cc3ccccc3)C2=O)CC1
InChI Key InChIKey=KNBIVKJOUZJOOG-CJMKKMBJSA-N
Data  1 IC50
  Tab Delimited (TSV)   2D SDfile   Computed 3D by Vconf -m prep SDfile
Find this compound or compounds like it in BindingDB:
Activity Spreadsheet -- Enzyme Inhibition Constant Data from BindingDB
Found 1 hit for monomerid = 502079
TargetProtein arginine N-methyltransferase 1(Homo sapiens)
Board Of Regents, The University Of Texas System
US Patent
LigandPNGBDBM502079(US11028083, Example 67b)
Affinity DataIC50:  590nM. Assay description: This enzymatic assay was performed in a 384 well, white, low volume plate (PerkinElmer, Catalog 6008289) with assay buffer consisting of 50 mM Hepes ...
Ligand InfoPC cidPC sid
In DepthDetails US Patent