BDBM50208945 CHEMBL224024::N6-(4-hydroxybenzyl)adenine riboside
SMILES OC[C@H]1O[C@H]([C@H](O)[C@@H]1O)n1cnc2c(NCc3ccc(O)cc3)ncnc12
InChI Key InChIKey=UGVIXKXYLBAZND-LSCFUAHRSA-N
Data  1 KI  1 IC50
PDB links: 1 PDB ID matches this monomer.
  Tab Delimited (TSV)   2D SDfile   Computed 3D by Vconf -m prep SDfile
Find this compound or compounds like it in BindingDB:
Activity Spreadsheet -- Enzyme Inhibition Constant Data from BindingDB
Found 2 hits for monomerid = 50208945
TargetAdenosine receptor A2a(Rattus norvegicus (rat))
National Research Institute Of Chinese Medicine
Curated by ChEMBL
LigandPNGBDBM50208945(CHEMBL224024 | N6-(4-hydroxybenzyl)adenine ribosid...)
Affinity DataKi:  2.62E+3nM. Assay description: Binding affinity to adenosine A2A receptor in rat brain striatum
In DepthDetails ArticlePubMed
TargetAdenosine receptor A2a(Rattus norvegicus (rat))
National Research Institute Of Chinese Medicine
Curated by ChEMBL
LigandPNGBDBM50208945(CHEMBL224024 | N6-(4-hydroxybenzyl)adenine ribosid...)
Affinity DataIC50:  4.66E+3nM. Assay description: Binding affinity to adenosine A2A receptor in rat brain striatum
In DepthDetails ArticlePubMed