BDBM502091 US11028083, Example 73b
SMILES CNCCN(C)Cc1nn2CCCc2c1[C@H]1CCC2(COC(C)(C)C2)CC1
InChI Key InChIKey=VHTAZQOOTVADEU-FYUAEQPTSA-N
Data  1 IC50
  Tab Delimited (TSV)   2D SDfile   Computed 3D by Vconf -m prep SDfile
Find this compound or compounds like it in BindingDB:
Activity Spreadsheet -- Enzyme Inhibition Constant Data from BindingDB
Found 1 hit for monomerid = 502091
TargetProtein arginine N-methyltransferase 1(Homo sapiens)
Board Of Regents, The University Of Texas System
US Patent
LigandPNGBDBM502091(US11028083, Example 73b)
Affinity DataIC50:  65nM. Assay description: This enzymatic assay was performed in a 384 well, white, low volume plate (PerkinElmer, Catalog 6008289) with assay buffer consisting of 50 mM Hepes ...
Ligand InfoPC cidPC sid
In DepthDetails US Patent