BDBM50209191 6-(5-cyclopentyl-2-hydroxyphenyl)-4-(2,5-dichlorophenyl)-2-oxo-1,2-dihydropyridine-3-carbonitrile::CHEMBL232402
SMILES Oc1ccc(cc1-c1cc(-c2cc(Cl)ccc2Cl)c(C#N)c(=O)[nH]1)C1CCCC1
InChI Key InChIKey=LDKWIJMNHXVJGA-UHFFFAOYSA-N
Data  1 Kd
  Tab Delimited (TSV)   2D SDfile   Computed 3D by Vconf -m prep SDfile
Find this compound or compounds like it in BindingDB:
Activity Spreadsheet -- Enzyme Inhibition Constant Data from BindingDB
Found 1 hit for monomerid = 50209191
TargetBaculoviral IAP repeat-containing protein 5(Homo sapiens (Human))
Abbott Laboratories
Curated by ChEMBL
LigandPNGBDBM50209191(6-(5-cyclopentyl-2-hydroxyphenyl)-4-(2,5-dichlorop...)
Affinity DataKd:  510nM. Assay description: Binding affinity to human survivin expressed in Escherichia coli BL21 cells after 30 mins
In DepthDetails ArticlePubMed