BDBM50209196 6-(5-bromo-2-hydroxy-phenyl)-4-(4-chloro-biphenyl-3-yl)-2-oxo-1,2-dihydro-pyridine-3-carbonitrile::CHEMBL392065
SMILES Oc1ccc(Br)cc1-c1cc(-c2cc(ccc2Cl)-c2ccccc2)c(C#N)c(=O)[nH]1
InChI Key InChIKey=MLWSADJBOPYABB-UHFFFAOYSA-N
Data  1 Kd
  Tab Delimited (TSV)   2D SDfile   Computed 3D by Vconf -m prep SDfile
Find this compound or compounds like it in BindingDB:
Activity Spreadsheet -- Enzyme Inhibition Constant Data from BindingDB
Found 1 hit for monomerid = 50209196
TargetBaculoviral IAP repeat-containing protein 5(Homo sapiens (Human))
Abbott Laboratories
Curated by ChEMBL
LigandPNGBDBM50209196(6-(5-bromo-2-hydroxy-phenyl)-4-(4-chloro-biphenyl-...)
Affinity DataKd: >4.30E+3nM. Assay description: Binding affinity to human survivin expressed in Escherichia coli BL21 cells after 30 mins
In DepthDetails ArticlePubMed