BDBM50209327 1-(6-(azetidin-1-yl)-2-cyclopropylpyrimidin-4-yl)azepane::CHEMBL232416
SMILES C1CC1c1nc(cc(n1)N1CCCCCC1)N1CCC1
InChI Key InChIKey=UZFSUYXDEBVIPE-UHFFFAOYSA-N
Data  1 KI
  Tab Delimited (TSV)   2D SDfile   Computed 3D by Vconf -m prep SDfile
Find this compound or compounds like it in BindingDB:
Activity Spreadsheet -- Enzyme Inhibition Constant Data from BindingDB
Found 1 hit for monomerid = 50209327
TargetMuscarinic acetylcholine receptor M3(Homo sapiens (Human))
Ucb Pharma
Curated by ChEMBL
LigandPNGBDBM50209327(1-(6-(azetidin-1-yl)-2-cyclopropylpyrimidin-4-yl)a...)
Affinity DataKi:  79nM. Assay description: Displacement of [3H]N-methylscopolamine from human recombinant M3 muscarinic receptor expressed in CHO cell membrane
In DepthDetails ArticlePubMed