BDBM50209330 1-(6-(azepan-1-yl)-2-cyclopropyl-5-methylpyrimidin-4-yl)azetidin-3-ol::CHEMBL242822
SMILES Cc1c(nc(nc1N1CCCCCC1)C1CC1)N1CC(O)C1
InChI Key InChIKey=LOFIKFNSIYDUDB-UHFFFAOYSA-N
Data  1 KI
  Tab Delimited (TSV)   2D SDfile   Computed 3D by Vconf -m prep SDfile
Find this compound or compounds like it in BindingDB:
Activity Spreadsheet -- Enzyme Inhibition Constant Data from BindingDB
Found 1 hit for monomerid = 50209330
TargetMuscarinic acetylcholine receptor M3(Homo sapiens (Human))
Ucb Pharma
Curated by ChEMBL
LigandPNGBDBM50209330(1-(6-(azepan-1-yl)-2-cyclopropyl-5-methylpyrimidin...)
Affinity DataKi:  158nM. Assay description: Displacement of [3H]N-methylscopolamine from human recombinant M3 muscarinic receptor expressed in CHO cell membrane
In DepthDetails ArticlePubMed