BDBM50209678 CHEMBL401424::N-(2-(5-fluoro-1H-indol-3-yl)ethyl)-2,3-dihydro-1H-pyrano[3,2-f]quinolin-2-amine
SMILES Fc1ccc2[nH]cc(CCNC3COc4ccc5ncccc5c4C3)c2c1
InChI Key InChIKey=RWPZZHXGPZAEAQ-UHFFFAOYSA-N
Data  1 KI
  Tab Delimited (TSV)   2D SDfile   Computed 3D by Vconf -m prep SDfile
Find this compound or compounds like it in BindingDB:
Activity Spreadsheet -- Enzyme Inhibition Constant Data from BindingDB
Found 1 hit for monomerid = 50209678
TargetSodium-dependent serotonin transporter(Rattus norvegicus (rat))
Wyeth Research
Curated by ChEMBL
LigandPNGBDBM50209678(CHEMBL401424 | N-(2-(5-fluoro-1H-indol-3-yl)ethyl)...)
Affinity DataKi:  30.5nM. Assay description: Displacement of [3H]paroxetine from 5HT reuptake site of rat cortical 5HTT
In DepthDetails ArticlePubMed