BDBM50209793 CHEMBL335172
SMILES CC(Cl)(Cl)C(N\C(NC#N)=N\c1cccnc1)NC(=O)c1ccc(Cl)cc1
InChI Key InChIKey=VWXQCJYCNKGDEL-UHFFFAOYSA-N
Data  1 EC50
  Tab Delimited (TSV)   2D SDfile   Computed 3D by Vconf -m prep SDfile
Find this compound or compounds like it in BindingDB:
Activity Spreadsheet -- Enzyme Inhibition Constant Data from BindingDB
Found 1 hit for monomerid = 50209793
LigandPNGBDBM50209793(CHEMBL335172)
Affinity DataEC50:  2.00E+3nM. Assay description: In vitro ATP-sensitive potassium channel (KATP) activity in cells expressing human KATP channels Kir6.2 and sulfonylurea receptor 2B
In DepthDetails ArticlePubMed