BDBM502099 US11028083, Example 77b
SMILES CNCCN(C)Cc1nn2CCCc2c1[C@H]1CCC(C)(CC1)C(=O)N(C)C
InChI Key InChIKey=VYLYLWBIWAQNLH-UANQYBHISA-N
Data  1 IC50
  Tab Delimited (TSV)   2D SDfile   Computed 3D by Vconf -m prep SDfile
Find this compound or compounds like it in BindingDB:
Activity Spreadsheet -- Enzyme Inhibition Constant Data from BindingDB
Found 1 hit for monomerid = 502099
TargetProtein arginine N-methyltransferase 1(Homo sapiens)
Board Of Regents, The University Of Texas System
US Patent
LigandPNGBDBM502099(US11028083, Example 77b)
Affinity DataIC50:  457nM. Assay description: This enzymatic assay was performed in a 384 well, white, low volume plate (PerkinElmer, Catalog 6008289) with assay buffer consisting of 50 mM Hepes ...
Ligand InfoPC cidPC sid
In DepthDetails US Patent