BDBM50210223 1-benzhydryl-4-phenylpiperidin-4-ol::CHEMBL228690
SMILES OC1(CCN(CC1)C(c1ccccc1)c1ccccc1)c1ccccc1
InChI Key InChIKey=PMLFKOKTRMHUPA-UHFFFAOYSA-N
Data  12 KI
  Tab Delimited (TSV)   2D SDfile   Computed 3D by Vconf -m prep SDfile
Find this compound or compounds like it in BindingDB:
Activity Spreadsheet -- Enzyme Inhibition Constant Data from BindingDB
Found 12 hits for monomerid = 50210223
TargetNociceptin receptor(Homo sapiens (Human))
Schering-Plough Research Institute
Curated by ChEMBL
LigandPNGBDBM50210223(1-benzhydryl-4-phenylpiperidin-4-ol | CHEMBL228690)
Affinity DataKi:  13nM. Assay description: Displacement of [125I][Tyr14]nociceptin FQ from human NOP receptor expressed in CHO cell membrane
In DepthDetails ArticlePubMed
TargetNociceptin receptor(Homo sapiens (Human))
Schering-Plough Research Institute
Curated by ChEMBL
LigandPNGBDBM50210223(1-benzhydryl-4-phenylpiperidin-4-ol | CHEMBL228690)
Affinity DataKi:  13nM. Assay description: Displacement of [125I][Tyr14]nociceptin from human cloned NOP receptor expressed in CHO cells
In DepthDetails ArticlePubMed
TargetNociceptin receptor(Homo sapiens (Human))
Schering-Plough Research Institute
Curated by ChEMBL
LigandPNGBDBM50210223(1-benzhydryl-4-phenylpiperidin-4-ol | CHEMBL228690)
Affinity DataKi:  13nM. Assay description: Agonist activity at human NOP receptor expressed in CHO cells assessed as stimulation of [35S]GTP-gamma-S binding
In DepthDetails ArticlePubMed
TargetMu-type opioid receptor(Homo sapiens (Human))
Schering-Plough Research Institute
Curated by ChEMBL
LigandPNGBDBM50210223(1-benzhydryl-4-phenylpiperidin-4-ol | CHEMBL228690)
Affinity DataKi:  207nM. Assay description: Displacement of [3H]diprenorphine from human MOP receptor expressed in CHO cell membrane
In DepthDetails ArticlePubMed
TargetMu-type opioid receptor(Homo sapiens (Human))
Schering-Plough Research Institute
Curated by ChEMBL
LigandPNGBDBM50210223(1-benzhydryl-4-phenylpiperidin-4-ol | CHEMBL228690)
Affinity DataKi:  233nM. Assay description: Displacement of [3H]diprenorphine from human MOP receptor expressed in CHO cell membranes
In DepthDetails ArticlePubMed
TargetMu-type opioid receptor(Homo sapiens (Human))
Schering-Plough Research Institute
Curated by ChEMBL
LigandPNGBDBM50210223(1-benzhydryl-4-phenylpiperidin-4-ol | CHEMBL228690)
Affinity DataKi:  233nM. Assay description: Displacement of [3H]diprenorphine from human mu opioid receptor expressed in CHO cells
In DepthDetails ArticlePubMed
TargetKappa-type opioid receptor(Homo sapiens (Human))
Schering-Plough Research Institute
Curated by ChEMBL
LigandPNGBDBM50210223(1-benzhydryl-4-phenylpiperidin-4-ol | CHEMBL228690)
Affinity DataKi:  364nM. Assay description: Displacement of [3H]diprenorphine from human kappa opioid receptor expressed in CHO cells
In DepthDetails ArticlePubMed
TargetKappa-type opioid receptor(Homo sapiens (Human))
Schering-Plough Research Institute
Curated by ChEMBL
LigandPNGBDBM50210223(1-benzhydryl-4-phenylpiperidin-4-ol | CHEMBL228690)
Affinity DataKi:  364nM. Assay description: Displacement of [3H]diprenorphine from human KOP receptor expressed in CHO cell membranes
In DepthDetails ArticlePubMed
TargetKappa-type opioid receptor(Homo sapiens (Human))
Schering-Plough Research Institute
Curated by ChEMBL
LigandPNGBDBM50210223(1-benzhydryl-4-phenylpiperidin-4-ol | CHEMBL228690)
Affinity DataKi:  364nM. Assay description: Displacement of [3H]diprenorphine from human KOP receptor expressed in CHO cell membrane
In DepthDetails ArticlePubMed
TargetDelta-type opioid receptor(Homo sapiens (Human))
Schering-Plough Research Institute
Curated by ChEMBL
LigandPNGBDBM50210223(1-benzhydryl-4-phenylpiperidin-4-ol | CHEMBL228690)
Affinity DataKi:  1.67E+3nM. Assay description: Displacement of [3H]diprenorphine from human delta opioid receptor expressed in CHO cells
In DepthDetails ArticlePubMed
TargetDelta-type opioid receptor(Homo sapiens (Human))
Schering-Plough Research Institute
Curated by ChEMBL
LigandPNGBDBM50210223(1-benzhydryl-4-phenylpiperidin-4-ol | CHEMBL228690)
Affinity DataKi:  1.67E+3nM. Assay description: Displacement of [3H]diprenorphine from human DOP receptor expressed in CHO cell membrane
In DepthDetails ArticlePubMed
TargetDelta-type opioid receptor(Homo sapiens (Human))
Schering-Plough Research Institute
Curated by ChEMBL
LigandPNGBDBM50210223(1-benzhydryl-4-phenylpiperidin-4-ol | CHEMBL228690)
Affinity DataKi:  1.67E+3nM. Assay description: Displacement of [3H]diprenorphine from human DOP receptor expressed in CHO cell membranes
In DepthDetails ArticlePubMed