BDBM502114 US11028083, Example 86b
SMILES CNCCN(C)Cc1nn2CC(F)(F)Cc2c1[C@H]1CC[C@]2(CC1)CCC(C)(C)OC2
InChI Key InChIKey=UAXQMDYKVFYQBH-VVOJOOEHSA-N
Data  1 IC50
  Tab Delimited (TSV)   2D SDfile   Computed 3D by Vconf -m prep SDfile
Find this compound or compounds like it in BindingDB:
Activity Spreadsheet -- Enzyme Inhibition Constant Data from BindingDB
Found 1 hit for monomerid = 502114
TargetProtein arginine N-methyltransferase 1(Homo sapiens)
Board Of Regents, The University Of Texas System
US Patent
LigandPNGBDBM502114(US11028083, Example 86b)
Affinity DataIC50:  30nM. Assay description: This enzymatic assay was performed in a 384 well, white, low volume plate (PerkinElmer, Catalog 6008289) with assay buffer consisting of 50 mM Hepes ...
Ligand InfoPC cidPC sid
In DepthDetails US Patent