BDBM50211902 5-((5-(3,5-dichlorophenyl)furan-2-yl)methylene)-2-thioxothiazolidin-4-one::CHEMBL227620
SMILES SC1=NC(=O)C(S1)=Cc1ccc(o1)-c1cc(Cl)cc(Cl)c1
InChI Key InChIKey=SULFIKDZDGQWBD-UHFFFAOYSA-N
Data  2 KI  1 IC50
  Tab Delimited (TSV)   2D SDfile   Computed 3D by Vconf -m prep SDfile
Find this compound or compounds like it in BindingDB:
Activity Spreadsheet -- Enzyme Inhibition Constant Data from BindingDB
Found 3 hits for monomerid = 50211902
TargetEnoyl-acyl-carrier protein reductase(Plasmodium falciparum)
Institute Of Science
Curated by ChEMBL
LigandPNGBDBM50211902(5-((5-(3,5-dichlorophenyl)furan-2-yl)methylene)-2-...)
Affinity DataKi:  4.10E+3nM. Assay description: Inhibition of Plasmodium falciparum recombinant enoyl ACP reductase expressed in BL21 (DE3) cells with respect to crotonyl CoA
In DepthDetails ArticlePubMed
TargetEnoyl-acyl-carrier protein reductase(Plasmodium falciparum)
Institute Of Science
Curated by ChEMBL
LigandPNGBDBM50211902(5-((5-(3,5-dichlorophenyl)furan-2-yl)methylene)-2-...)
Affinity DataKi:  5.50E+3nM. Assay description: Inhibition of Plasmodium falciparum recombinant enoyl ACP reductase expressed in BL21 (DE3) cells with respect to NADH
In DepthDetails ArticlePubMed
TargetEnoyl-acyl-carrier protein reductase(Plasmodium falciparum)
Institute Of Science
Curated by ChEMBL
LigandPNGBDBM50211902(5-((5-(3,5-dichlorophenyl)furan-2-yl)methylene)-2-...)
Affinity DataIC50:  6.10E+3nM. Assay description: Inhibition of Plasmodium falciparum recombinant enoyl ACP reductase expressed in BL21 (DE3) cells
In DepthDetails ArticlePubMed