BDBM50213696 3-((3E,7E)-11-((E)-4,8-dimethylnona-4,7-dienylthio)-3,7-dimethylundeca-3,7-dienyl)-2,2-dimethyloxirane::CHEMBL253785
SMILES [#6]\[#6](-[#6])=[#6]\[#6]\[#6]=[#6](/[#6])-[#6]-[#6]-[#6]-[#16]-[#6]-[#6]-[#6]\[#6]=[#6](/[#6])-[#6]-[#6]\[#6]=[#6](/[#6])-[#6]-[#6]-[#6]1-[#8]C1([#6])[#6]
InChI Key InChIKey=HVMMAFONHKWNIY-HAHXBMLTSA-N
Data  1 IC50
  Tab Delimited (TSV)   2D SDfile   Computed 3D by Vconf -m prep SDfile
Find this compound or compounds like it in BindingDB:
Activity Spreadsheet -- Enzyme Inhibition Constant Data from BindingDB
Found 1 hit for monomerid = 50213696
TargetLanosterol synthase(Rattus norvegicus)
Sinhgad College Of Pharmacy
Curated by ChEMBL
LigandPNGBDBM50213696(3-((3E,7E)-11-((E)-4,8-dimethylnona-4,7-dienylthio...)
Affinity DataIC50:  50nM. Assay description: Inhibition of rat OSC
In DepthDetails ArticlePubMed