BDBM50213757 3-(2-bromo-6-fluoro-phenylamino)-7-chloro-1,1-dioxo-1,4-dihydro-1lambda6-benzo[1,2,4]thiadiazin-5-ol::CHEMBL397869
SMILES Oc1cc(Cl)cc2c1N=C(Nc1c(F)cccc1Br)NS2(=O)=O
InChI Key InChIKey=MGNPAGUVQLDGRQ-UHFFFAOYSA-N
Data  1 IC50
  Tab Delimited (TSV)   2D SDfile   Computed 3D by Vconf -m prep SDfile
Find this compound or compounds like it in BindingDB:
Activity Spreadsheet -- Enzyme Inhibition Constant Data from BindingDB
Found 1 hit for monomerid = 50213757
TargetC-X-C chemokine receptor type 2(Homo sapiens (Human))
Glaxosmithkline
Curated by ChEMBL
LigandPNGBDBM50213757(3-(2-bromo-6-fluoro-phenylamino)-7-chloro-1,1-diox...)
Affinity DataIC50:  1.60E+3nM. Assay description: Antagonist activity at CXCR2 receptor expressed in CHOK1 cells assessed as human IL8-induced calcium mobilization by FLIPR
In DepthDetails ArticlePubMed