BDBM50213846 CHEMBL20251
SMILES COc1cc(Cl)ccc1N1CCN(CCCCNC(=O)C(C)(C)C)CC1
InChI Key InChIKey=BXDBIOHPDJQSGV-UHFFFAOYSA-N
Data  2 KI
  Tab Delimited (TSV)   2D SDfile   Computed 3D by Vconf -m prep SDfile
Find this compound or compounds like it in BindingDB:
Activity Spreadsheet -- Enzyme Inhibition Constant Data from BindingDB
Found 2 hits for monomerid = 50213846
TargetD(4) dopamine receptor(Homo sapiens (Human))TBA
LigandPNGBDBM50213846(CHEMBL20251)
Affinity DataKi:  16nM. Assay description: Binding affinity at cloned human Dopamine receptor D4 expressed in HEK 293 cells, using [3H]nemonapride as radioligand
In DepthDetails
TargetD(2) dopamine receptor(Homo sapiens (Human))TBA
LigandPNGBDBM50213846(CHEMBL20251)
Affinity DataKi:  158nM. Assay description: Binding affinity at cloned human Dopamine receptor D2 expressed in CHO cells, using [125I]iodosulpiride as radioligand
In DepthDetails