BDBM50214642 1-(2,6-dichloro-4-(trifluoromethyl)phenyl)-4-pentyl-1H-1,2,3-triazole::CHEMBL236208
SMILES CCCCCc1cn(nn1)-c1c(Cl)cc(cc1Cl)C(F)(F)F
InChI Key InChIKey=ZFBFICSZKAYMMA-UHFFFAOYSA-N
Data  1 KI
  Tab Delimited (TSV)   2D SDfile   Computed 3D by Vconf -m prep SDfile
Find this compound or compounds like it in BindingDB:
Activity Spreadsheet -- Enzyme Inhibition Constant Data from BindingDB
Found 1 hit for monomerid = 50214642
TargetGamma-aminobutyric acid receptor subunit alpha-2/beta-2/gamma-2(Homo sapiens (Human))
Shimane University
Curated by ChEMBL
LigandPNGBDBM50214642(1-(2,6-dichloro-4-(trifluoromethyl)phenyl)-4-penty...)
Affinity DataKi:  1.39E+3nM. Assay description: Displacement of [3H]EBOB from human recombinant GABA alpha-1-beta-2-gamma-2 receptor expressed in HEK293 cells
In DepthDetails ArticlePubMed