BDBM50214928 (Z)-(2-((9-hydroxy-10-methoxy-2,2,4-trimethyl-1,2-dihydro-4aH-chromeno[3,4-f]quinolin-5(12aH)-ylidene)methyl)thiophen-3-yl)(piperidin-1-yl)methanone::CHEMBL232573
SMILES COc1c(O)ccc2O\C(=C/c3sccc3C(=O)N3CCCCC3)C3=C(C=CC4NC(C)(C)C=C(C)C34)c12
InChI Key InChIKey=YNLLLFCGVZQNDE-JLPGSUDCSA-N
Data  1 KI  2 IC50  1 EC50
  Tab Delimited (TSV)   2D SDfile   Computed 3D by Vconf -m prep SDfile
Find this compound or compounds like it in BindingDB:
Activity Spreadsheet -- Enzyme Inhibition Constant Data from BindingDB
Found 4 hits for monomerid = 50214928
TargetGlucocorticoid receptor(Homo sapiens (Human))
Ligand Pharmaceuticals
Curated by ChEMBL
LigandPNGBDBM50214928((Z)-(2-((9-hydroxy-10-methoxy-2,2,4-trimethyl-1,2-...)
Affinity DataKi:  1.40nM. Assay description: Displacement of radiolabeled dexamethasone from glucocorticoid receptor
In DepthDetails ArticlePubMed
TargetGlucocorticoid receptor(Homo sapiens (Human))
Ligand Pharmaceuticals
Curated by ChEMBL
LigandPNGBDBM50214928((Z)-(2-((9-hydroxy-10-methoxy-2,2,4-trimethyl-1,2-...)
Affinity DataEC50:  0.200nM. Assay description: Agonist activity at GR by GRE activation assay
In DepthDetails ArticlePubMed
TargetGlucocorticoid receptor(Homo sapiens (Human))
Ligand Pharmaceuticals
Curated by ChEMBL
LigandPNGBDBM50214928((Z)-(2-((9-hydroxy-10-methoxy-2,2,4-trimethyl-1,2-...)
Affinity DataIC50:  4.10nM. Assay description: Antagonist activity at GR assessed as inhibition of dexamethasone-induced GRE activation
In DepthDetails ArticlePubMed
TargetGlucocorticoid receptor(Homo sapiens (Human))
Ligand Pharmaceuticals
Curated by ChEMBL
LigandPNGBDBM50214928((Z)-(2-((9-hydroxy-10-methoxy-2,2,4-trimethyl-1,2-...)
Affinity DataIC50:  0.700nM. Assay description: Activity at GR assessed as repression of TNFalpha and IL 1beta induced E-selectin response
In DepthDetails ArticlePubMed