BDBM50215050 CHEMBL236933::LTERHKILHRLLQEGSPSD
SMILES CC[C@H](C)[C@H](NC(=O)[C@H](CCCCN)NC(=O)[C@H](Cc1cnc[nH]1)NC(=O)[C@H](CCCN=C(N)N)NC(=O)[C@H](CCC(O)=O)NC(=O)[C@@H](NC(=O)[C@@H](N)CC(C)C)[C@@H](C)O)C(=O)N[C@@H](CC(C)C)C(=O)N[C@@H](Cc1cnc[nH]1)C(=O)N[C@@H](CCCN=C(N)N)C(=O)N[C@@H](CC(C)C)C(=O)N[C@@H](CC(C)C)C(=O)N[C@@H](CCC(N)=O)C(=O)N[C@@H](CCC(O)=O)C(=O)NCC(=O)N[C@@H](CO)C(=O)N1CCCC1C(=O)N[C@@H](CO)C(=O)N[C@@H](CC(O)=O)C(O)=O
InChI Key InChIKey=QPHCCOQIWMPOQX-KTGODZLYSA-N
Data  1 KI
  Tab Delimited (TSV)   2D SDfile   Computed 3D by Vconf -m prep SDfile
Find this compound or compounds like it in BindingDB:
Activity Spreadsheet -- Enzyme Inhibition Constant Data from BindingDB
Found 1 hit for monomerid = 50215050
TargetEstrogen receptor(Homo sapiens (Human))
University Of Illinois
Curated by ChEMBL
LigandPNGBDBM50215050(CHEMBL236933 | LTERHKILHRLLQEGSPSD)
Affinity DataKi:  190nM. Assay description: Displacement of iodoacetamide-fluorescein-labeled SRC3 from ERalpha by TR-FRET assay
In DepthDetails ArticlePubMed