BDBM50216995 CHEMBL319815
SMILES COc1cccc(CCNc2ncc(C)n(CC(=O)NCc3ccc4[nH]ncc4c3)c2=O)c1
InChI Key InChIKey=DZUJSVCIXKMKNL-UHFFFAOYSA-N
Data  1 KI
  Tab Delimited (TSV)   2D SDfile   Computed 3D by Vconf -m prep SDfile
Find this compound or compounds like it in BindingDB:
Activity Spreadsheet -- Enzyme Inhibition Constant Data from BindingDB
Found 1 hit for monomerid = 50216995
TargetProthrombin(Homo sapiens (Human))
Corvas International
Curated by ChEMBL
LigandPNGBDBM50216995(CHEMBL319815)
Affinity DataKi:  10nM. Assay description: In vitro inhibitory activity against human Thrombin (FIIa) cleavage of the chromogenic substrate
In DepthDetails ArticlePubMed