BDBM50218599 CHEMBL115059
SMILES Cc1ccc(C)c(OCc2c[nH]cn2)c1
InChI Key InChIKey=UZMAAKFUJZGROT-UHFFFAOYSA-N
Data  1 IC50
  Tab Delimited (TSV)   2D SDfile   Computed 3D by Vconf -m prep SDfile
Find this compound or compounds like it in BindingDB:
Activity Spreadsheet -- Enzyme Inhibition Constant Data from BindingDB
Found 1 hit for monomerid = 50218599
TargetAlpha-1A/Alpha-1B/Alpha-1D adrenergic receptor(Rattus norvegicus (rat))
Glaxosmithkline
Curated by ChEMBL
LigandPNGBDBM50218599(CHEMBL115059)
Affinity DataIC50:  102nM. Assay description: Inhibition of binding of [3H]-prazosin at alpha1 adrenoceptors isolated from rat brain
In DepthDetails ArticlePubMed