BDBM50218600 CHEMBL325648
SMILES C(Nc1ccccc1N1CCCCC1)c1c[nH]cn1
InChI Key InChIKey=IIGMRZNQNZVRHU-UHFFFAOYSA-N
Data  3 EC50
  Tab Delimited (TSV)   2D SDfile   Computed 3D by Vconf -m prep SDfile
Find this compound or compounds like it in BindingDB:
Activity Spreadsheet -- Enzyme Inhibition Constant Data from BindingDB
Found 3 hits for monomerid = 50218600
TargetAlpha-1A adrenergic receptor(Homo sapiens (Human))
Glaxosmithkline
Curated by ChEMBL
LigandPNGBDBM50218600(CHEMBL325648)
Affinity DataEC50:  50nM. Assay description: Activation of human alpha-1A adrenergic receptor expressed in rat-1 fibroblasts
In DepthDetails ArticlePubMed
TargetAlpha-1B adrenergic receptor(Homo sapiens (Human))
Glaxosmithkline
Curated by ChEMBL
LigandPNGBDBM50218600(CHEMBL325648)
Affinity DataEC50: <5.01E+3nM. Assay description: Activation of human alpha-1B adrenergic receptors expressed in rat-1 fibroblasts
In DepthDetails ArticlePubMed
TargetAlpha-1D adrenergic receptor(Homo sapiens (Human))
Glaxosmithkline
Curated by ChEMBL
LigandPNGBDBM50218600(CHEMBL325648)
Affinity DataEC50: <5.01E+3nM. Assay description: Activation of human Alpha-1D adrenergic receptors expressed in rat-1 fibroblasts
In DepthDetails ArticlePubMed