BDBM50218927 CHEMBL389318::N-benzoyl-N-(2-phenyl-2H-pyrazolo[3,4-c]quinolin-4-yl)-benzamide::N-benzoyl-N-(2-phenyl-2H-pyrazolo[3,4-c]quinolin-4-yl)benzamide
SMILES O=C(N(C(=O)c1ccccc1)c1nc2ccccc2c2cn(nc12)-c1ccccc1)c1ccccc1
InChI Key InChIKey=WUEJVUGSTSTOHL-UHFFFAOYSA-N
Data  2 KI
  Tab Delimited (TSV)   2D SDfile   Computed 3D by Vconf -m prep SDfile
Find this compound or compounds like it in BindingDB:
Activity Spreadsheet -- Enzyme Inhibition Constant Data from BindingDB
Found 2 hits for monomerid = 50218927
TargetAdenosine receptor A3(Homo sapiens (Human))
Università
Curated by ChEMBL
LigandPNGBDBM50218927(CHEMBL389318 | N-benzoyl-N-(2-phenyl-2H-pyrazolo[3...)
Affinity DataKi:  6.10nM. Assay description: Displacement of [125I]AB-MECA from human adenosine A3 receptor expressed in CHO cells by scintillation counting
In DepthDetails ArticlePubMed
TargetAdenosine receptor A3(Homo sapiens (Human))
Università
Curated by ChEMBL
LigandPNGBDBM50218927(CHEMBL389318 | N-benzoyl-N-(2-phenyl-2H-pyrazolo[3...)
Affinity DataKi:  6.10nM. Assay description: Displacement of [125I]AB-MECA from human adenosine A3 receptor expressed in CHO cells
In DepthDetails ArticlePubMed