BDBM50219130 CHEMBL95398
SMILES CC(C)COC(=O)c1ccccc1NCC1=NCCN1
InChI Key InChIKey=CBLUHSHTFYFAED-UHFFFAOYSA-N
Data  3 EC50
  Tab Delimited (TSV)   2D SDfile   Computed 3D by Vconf -m prep SDfile
Find this compound or compounds like it in BindingDB:
Activity Spreadsheet -- Enzyme Inhibition Constant Data from BindingDB
Found 3 hits for monomerid = 50219130
TargetAlpha-1B adrenergic receptor(Homo sapiens (Human))
Glaxosmithkline
Curated by ChEMBL
LigandPNGBDBM50219130(CHEMBL95398)
Affinity DataEC50:  79nM. Assay description: Potency against cloned human alpha 1B adrenoceptor expressed in rat-1 fibroblasts.
In DepthDetails ArticlePubMed
TargetAlpha-1D adrenergic receptor(Homo sapiens (Human))
Glaxosmithkline
Curated by ChEMBL
LigandPNGBDBM50219130(CHEMBL95398)
Affinity DataEC50:  251nM. Assay description: Potency against cloned human alpha 1D-adrenoceptor expressed in rat-1 fibroblasts.
In DepthDetails ArticlePubMed
TargetAlpha-1A adrenergic receptor(Homo sapiens (Human))
Glaxosmithkline
Curated by ChEMBL
LigandPNGBDBM50219130(CHEMBL95398)
Affinity DataEC50:  501nM. Assay description: Agonist potency against cloned human alpha 1A adrenoceptor expressed in rat-1 fibroblasts.
In DepthDetails ArticlePubMed