BDBM50219238 4-[4-(benzhydryloxy)piperidino]butyl benzoate::CHEMBL228999
SMILES O=C(OCCCCN1CCC(CC1)OC(c1ccccc1)c1ccccc1)c1ccccc1
InChI Key InChIKey=SUQKPOGAPWZPRM-UHFFFAOYSA-N
Data  2 IC50
  Tab Delimited (TSV)   2D SDfile   Computed 3D by Vconf -m prep SDfile
Find this compound or compounds like it in BindingDB:
Activity Spreadsheet -- Enzyme Inhibition Constant Data from BindingDB
Found 2 hits for monomerid = 50219238
TargetCholinesterase(Homo sapiens (Human))
Woosuk University
Curated by ChEMBL
LigandPNGBDBM50219238(4-[4-(benzhydryloxy)piperidino]butyl benzoate | CH...)
Affinity DataIC50:  3.16E+4nM. Assay description: Inhibition of human BChE by Ellman's method
In DepthDetails ArticlePubMed
TargetAcetylcholinesterase(Electrophorus electricus (Electric eel))
Woosuk University
Curated by ChEMBL
LigandPNGBDBM50219238(4-[4-(benzhydryloxy)piperidino]butyl benzoate | CH...)
Affinity DataIC50:  1.31E+3nM. Assay description: Inhibition of Electrophorus electricus AChE by Ellman's method
In DepthDetails ArticlePubMed