BDBM50219316 CHEMBL545353
SMILES Cl.Cl.C[C@H](Nc1nccc(n1)-c1cc(nnc1-c1cccc(c1)C(F)(F)F)C1CCNCC1)c1ccccc1
InChI Key InChIKey=HFLZGVLGGKBWFL-NTEVMMBTSA-N
Data  1 IC50
  Tab Delimited (TSV)   2D SDfile   Computed 3D by Vconf -m prep SDfile
Find this compound or compounds like it in BindingDB:
Activity Spreadsheet -- Enzyme Inhibition Constant Data from BindingDB
Found 1 hit for monomerid = 50219316
TargetMitogen-activated protein kinase 11/12/13/14(Homo sapiens (Human))
Merck Research Laboratories
Curated by ChEMBL
LigandPNGBDBM50219316(CHEMBL545353)
Affinity DataIC50:  0.150nM. Assay description: Inhibition of Mitogen-activated protein kinase p38
In DepthDetails ArticlePubMed