BDBM50219946 CHEMBL391700::N-((1r,4r)-4-(2-(4-(3-(trifluoromethyl)phenyl)piperazin-1-yl)ethyl)cyclohexyl)pyridine-3-sulfonamide
SMILES FC(F)(F)c1cccc(c1)N1CCN(CC[C@H]2CC[C@@H](CC2)NS(=O)(=O)c2cccnc2)CC1
InChI Key InChIKey=KYNADVPWOIATEI-XUTJKUGGSA-N
Data  2 IC50
  Tab Delimited (TSV)   2D SDfile   Computed 3D by Vconf -m prep SDfile
Find this compound or compounds like it in BindingDB:
Activity Spreadsheet -- Enzyme Inhibition Constant Data from BindingDB
Found 2 hits for monomerid = 50219946
TargetD(2) dopamine receptor(Rattus norvegicus (rat))
Gedeon Richter
Curated by ChEMBL
LigandPNGBDBM50219946(CHEMBL391700 | N-((1r,4r)-4-(2-(4-(3-(trifluoromet...)
Affinity DataIC50:  29nM. Assay description: Displacement of [3H]spiperone from dopamine D2 receptor in rat striatal membranes
In DepthDetails ArticlePubMed
TargetD(3) dopamine receptor(Rattus norvegicus (Rat))
Gedeon Richter
Curated by ChEMBL
LigandPNGBDBM50219946(CHEMBL391700 | N-((1r,4r)-4-(2-(4-(3-(trifluoromet...)
Affinity DataIC50:  0.300nM. Assay description: Displacement of [3H]spiperone from rat dopamine D3 receptor expressed in Sf9 cells
In DepthDetails ArticlePubMed