BDBM50220918 1-(1H-indol-4-yloxy)-3-(cyclopentylamino)propan-2-ol::CHEMBL237787
SMILES OC(CNC1CCCC1)COc1cccc2[nH]ccc12
InChI Key InChIKey=NJLIMDZJYJOPOS-UHFFFAOYSA-N
Data  2 KI
  Tab Delimited (TSV)   2D SDfile   Computed 3D by Vconf -m prep SDfile
Find this compound or compounds like it in BindingDB:
Activity Spreadsheet -- Enzyme Inhibition Constant Data from BindingDB
Found 2 hits for monomerid = 50220918
Target5-hydroxytryptamine receptor 1A(Homo sapiens (Human))
Eli Lilly
Curated by ChEMBL
LigandPNGBDBM50220918(1-(1H-indol-4-yloxy)-3-(cyclopentylamino)propan-2-...)
Affinity DataKi:  11nM. Assay description: Displacement of [3H]DPAT from human 5HT1A receptor
In DepthDetails ArticlePubMed
Target5-hydroxytryptamine receptor 1A(Homo sapiens (Human))
Eli Lilly
Curated by ChEMBL
LigandPNGBDBM50220918(1-(1H-indol-4-yloxy)-3-(cyclopentylamino)propan-2-...)
Affinity DataKi:  36nM. Assay description: Antagonist activity at human 5HT1A expressed in mouse LM(tK-) cells assessed as inhibition of 5HT-stimulated [35S]GTPgammaS binding
In DepthDetails ArticlePubMed