BDBM50220930 CHEMBL410364::adamantan-1-yl-[3-(1H-indol-4-yloxy)-2-methoxy-propyl]-amine
SMILES COC(CNC12CC3CC(CC(C3)C1)C2)COc1cccc2[nH]ccc12
InChI Key InChIKey=KNLGXVUCQVUDIQ-UHFFFAOYSA-N
Data  1 KI
  Tab Delimited (TSV)   2D SDfile   Computed 3D by Vconf -m prep SDfile
Find this compound or compounds like it in BindingDB:
Activity Spreadsheet -- Enzyme Inhibition Constant Data from BindingDB
Found 1 hit for monomerid = 50220930
Target5-hydroxytryptamine receptor 1A(Homo sapiens (Human))
Eli Lilly
Curated by ChEMBL
LigandPNGBDBM50220930(CHEMBL410364 | adamantan-1-yl-[3-(1H-indol-4-yloxy...)
Affinity DataKi:  32nM. Assay description: Displacement of [3H]DPAT from human 5HT1A receptor
In DepthDetails ArticlePubMed