BDBM50221550 4-(7-(2,6-difluoro-3-hydroxyphenyl)-5-methylbenzo[e][1,2,4]triazin-3-ylamino)-N-(2-(pyrrolidin-1-yl)ethyl)benzenesulfonamide::CHEMBL440963::US8481536, 556
SMILES Cc1cc(cc2nnc(Nc3ccc(cc3)S(=O)(=O)NCCN3CCCC3)nc12)-c1c(F)ccc(O)c1F
InChI Key InChIKey=GPTPEUDRFUOZSX-UHFFFAOYSA-N
Data  1 KI  1 IC50
  Tab Delimited (TSV)   2D SDfile   Computed 3D by Vconf -m prep SDfile
Find this compound or compounds like it in BindingDB:
Activity Spreadsheet -- Enzyme Inhibition Constant Data from BindingDB
Found 4 hits for monomerid = 50221550
TargetTyrosine-protein kinase ABL1(Homo sapiens (Human))
Targegen
Curated by ChEMBL
LigandPNGBDBM50221550(4-(7-(2,6-difluoro-3-hydroxyphenyl)-5-methylbenzo[...)
Affinity DataKi:  3.40nM. Assay description: Inhibition of Abl
In DepthDetails ArticlePubMed
TargetTyrosine-protein kinase ABL1(Homo sapiens (Human))
Targegen
Curated by ChEMBL
LigandPNGBDBM50221550(4-(7-(2,6-difluoro-3-hydroxyphenyl)-5-methylbenzo[...)
Affinity DataKi:  3.40nM
In DepthDetails
TargetTyrosine-protein kinase ABL1(Homo sapiens (Human))
Targegen
Curated by ChEMBL
LigandPNGBDBM50221550(4-(7-(2,6-difluoro-3-hydroxyphenyl)-5-methylbenzo[...)
Affinity DataKi:  51nM
In DepthDetails
TargetProto-oncogene tyrosine-protein kinase Src(Homo sapiens (Human))
Targegen
US Patent
LigandPNGBDBM50221550(4-(7-(2,6-difluoro-3-hydroxyphenyl)-5-methylbenzo[...)
Affinity DataIC50:  3.10nMT: 2°C. Assay description: Testing of inhibition of kinases in vitro using luciferase-based assay from KinaseGlo, Promega Corp.
In DepthDetails US Patent