BDBM50221797 CHEMBL274663
SMILES C[C@H](NC(=O)[C@@H](N)Cc1ccc(O)cc1)C(=O)NCC(=O)NCCc1ccccc1
InChI Key InChIKey=NDWWBICCRUEENI-KXBFYZLASA-N
Data  1 EC50
  Tab Delimited (TSV)   2D SDfile   Computed 3D by Vconf -m prep SDfile
Find this compound or compounds like it in BindingDB:
Activity Spreadsheet -- Enzyme Inhibition Constant Data from BindingDB
Found 1 hit for monomerid = 50221797
TargetReceptor-type tyrosine-protein phosphatase beta(Homo sapiens (Human))
Ruprecht-Karls-Universit£t Heidelberg
Curated by ChEMBL
LigandPNGBDBM50221797(CHEMBL5277981)
Affinity DataIC50:  4.10E+3nM. Assay description: In vitro thromboxane A2 receptor antagonism through inhibition of U-46619-induced platelet aggregation in human whole blood