BDBM50222627 CHEMBL356125
SMILES CC(C)N1CCC(CC1)c1cc(-c2ccccc2Cl)c2ccc(=O)n(-c3c(Cl)cccc3Cl)c2c1
InChI Key InChIKey=YELORNJOYXXAFO-UHFFFAOYSA-N
Data  2 IC50
  Tab Delimited (TSV)   2D SDfile   Computed 3D by Vconf -m prep SDfile
Find this compound or compounds like it in BindingDB:
Activity Spreadsheet -- Enzyme Inhibition Constant Data from BindingDB
Found 2 hits for monomerid = 50222627
TargetMitogen-activated protein kinase 11/12/13/14(Homo sapiens (Human))
Merck
Curated by ChEMBL
LigandPNGBDBM50222627(CHEMBL356125)
Affinity DataIC50:  0.200nM. Assay description: Inhibition of p38 MAP kinase
In DepthDetails ArticlePubMed
TargetMitogen-activated protein kinase 11/12/13/14(Homo sapiens (Human))
Merck
Curated by ChEMBL
LigandPNGBDBM50222627(CHEMBL356125)
Affinity DataIC50:  5.5nM. Assay description: Inhibition of p38 kinase related TNF-alpha release
In DepthDetails ArticlePubMed