BDBM50223698 5-cyano-N-(5-hydroxy-2-(piperidin-1-yl)phenyl)furan-2-carboxamide::CHEMBL249747
SMILES Oc1ccc(N2CCCCC2)c(NC(=O)c2ccc(o2)C#N)c1
InChI Key InChIKey=GHVPCKNUMUESLV-UHFFFAOYSA-N
Data  2 IC50
  Tab Delimited (TSV)   2D SDfile   Computed 3D by Vconf -m prep SDfile
Find this compound or compounds like it in BindingDB:
Activity Spreadsheet -- Enzyme Inhibition Constant Data from BindingDB
Found 2 hits for monomerid = 50223698
TargetMacrophage colony-stimulating factor 1 receptor(Homo sapiens (Human))
Johnson And Johnson Pharmaceutical Research And Development
Curated by ChEMBL
LigandPNGBDBM50223698(5-cyano-N-(5-hydroxy-2-(piperidin-1-yl)phenyl)fura...)
Affinity DataIC50:  2.70E+3nM. Assay description: Inhibition of ATP-induced autophosphorylation of cFMS tyrosine kinase in HEK 293 cells
In DepthDetails ArticlePubMed
TargetMacrophage colony-stimulating factor 1 receptor(Homo sapiens (Human))
Johnson And Johnson Pharmaceutical Research And Development
Curated by ChEMBL
LigandPNGBDBM50223698(5-cyano-N-(5-hydroxy-2-(piperidin-1-yl)phenyl)fura...)
Affinity DataIC50:  17nM. Assay description: Inhibition of ATP-induced autophosphorylation of cFMS tyrosine kinase
In DepthDetails ArticlePubMed