BDBM50223868 CHEMBL9604
SMILES CC(C)Oc1ccc(Sc2ccc(NC3=NCCN3)cc2)cc1
InChI Key InChIKey=FIFRYNRCBPJZBZ-UHFFFAOYSA-N
Data  1 KI
  Tab Delimited (TSV)   2D SDfile   Computed 3D by Vconf -m prep SDfile
Find this compound or compounds like it in BindingDB:
Activity Spreadsheet -- Enzyme Inhibition Constant Data from BindingDB
Found 1 hit for monomerid = 50223868
TargetProstacyclin receptor(Homo sapiens (Human))
Roche Palo Alto
Curated by ChEMBL
LigandPNGBDBM50223868(CHEMBL9604)
Affinity DataKi:  32nM. Assay description: Binding affinity towards prostacyclin receptor on rat NG-108-15 neuroblastoma cells, using [3H]iloprost as a radioligand
In DepthDetails ArticlePubMed