BDBM50224419 CHEMBL237662::N-[(3R,6S)-6-(2,3-difluorophenyl)-1-(2-methoxyethyl)-2-oxoazepan-3-yl]-4-(2-oxo-2,3-dihydro-1H-imidazo[4,5-b]pyridin-1-yl)piperidine-1-carboxamide
SMILES COCCN1C[C@@H](CC[C@@H](NC(=O)N2CCC(CC2)n2c3cccnc3[nH]c2=O)C1=O)c1cccc(F)c1F
InChI Key InChIKey=RMQWYDFJHWYQBI-DYESRHJHSA-N
Data  1 KI  2 IC50
  Tab Delimited (TSV)   2D SDfile   Computed 3D by Vconf -m prep SDfile
Find this compound or compounds like it in BindingDB:
Activity Spreadsheet -- Enzyme Inhibition Constant Data from BindingDB
Found 3 hits for monomerid = 50224419
TargetCalcitonin gene-related peptide type 1 receptor(Homo sapiens (Human))
Merck Research Laboratories
Curated by ChEMBL
LigandPNGBDBM50224419(CHEMBL237662 | N-[(3R,6S)-6-(2,3-difluorophenyl)-1...)
Affinity DataKi:  0.300nM. Assay description: Displacement of [125I]CGPR from human CL receptor expressed in HEK293 cells
In DepthDetails ArticlePubMed
TargetCalcitonin gene-related peptide type 1 receptor(Homo sapiens (Human))
Merck Research Laboratories
Curated by ChEMBL
LigandPNGBDBM50224419(CHEMBL237662 | N-[(3R,6S)-6-(2,3-difluorophenyl)-1...)
Affinity DataIC50:  2nM. Assay description: Antagonist activity at human CL receptor expressed in E10 cells assessed as CGRP-stimulated cAMP production
In DepthDetails ArticlePubMed
TargetCalcitonin gene-related peptide type 1 receptor(Homo sapiens (Human))
Merck Research Laboratories
Curated by ChEMBL
LigandPNGBDBM50224419(CHEMBL237662 | N-[(3R,6S)-6-(2,3-difluorophenyl)-1...)
Affinity DataIC50:  3nM. Assay description: Antagonist activity at human CL receptor expressed in E10 cells assessed as CGRP-stimulated cAMP production in presence of 50% human serum
In DepthDetails ArticlePubMed