BDBM50225339 CHEMBL31789
SMILES NCC1Cc2c1ccc(O)c2O
InChI Key InChIKey=WRACRVBNRQJLAA-UHFFFAOYSA-N
Data  2 KI
  Tab Delimited (TSV)   2D SDfile   Computed 3D by Vconf -m prep SDfile
Find this compound or compounds like it in BindingDB:
Activity Spreadsheet -- Enzyme Inhibition Constant Data from BindingDB
Found 2 hits for monomerid = 50225339
LigandPNGBDBM50225339(CHEMBL31789)
Affinity DataKi:  170nM. Assay description: Binding affinity towards alpha-2 adrenergic receptor in rat using [3H]rauwolscine as radioligand
In DepthDetails ArticlePubMed
TargetAlpha-1A/Alpha-1B/Alpha-1D adrenergic receptor(Rattus norvegicus (rat))
TBA
Curated by ChEMBL
LigandPNGBDBM50225339(CHEMBL31789)
Affinity DataKi:  1.60E+4nM. Assay description: Binding affinity against alpha-1 adrenergic receptor in rat using [3H]prazosin as radioligand
In DepthDetails ArticlePubMed