BDBM50225347 CHEMBL31258
SMILES CNCC1CCCc2c(O)c(O)ccc12
InChI Key InChIKey=HTXPKPRWZOGAPE-UHFFFAOYSA-N
Data  2 KI
  Tab Delimited (TSV)   2D SDfile   Computed 3D by Vconf -m prep SDfile
Find this compound or compounds like it in BindingDB:
Activity Spreadsheet -- Enzyme Inhibition Constant Data from BindingDB
Found 2 hits for monomerid = 50225347
LigandPNGBDBM50225347(CHEMBL31258)
Affinity DataKi:  44nM. Assay description: Binding affinity towards alpha-2 adrenergic receptor in rat using [3H]rauwolscine as radioligand
In DepthDetails ArticlePubMed
TargetAlpha-1A/Alpha-1B/Alpha-1D adrenergic receptor(Rattus norvegicus (rat))
TBA
Curated by ChEMBL
LigandPNGBDBM50225347(CHEMBL31258)
Affinity DataKi:  7.90E+3nM. Assay description: Binding affinity against alpha-1 adrenergic receptor in rat using [3H]prazosin as radioligand
In DepthDetails ArticlePubMed