BDBM50225352 CHEMBL285455
SMILES CCN(CC)CC1CCc2c1ccc(O)c2O
InChI Key InChIKey=GZWKMVRLWNTOER-UHFFFAOYSA-N
Data  2 KI
  Tab Delimited (TSV)   2D SDfile   Computed 3D by Vconf -m prep SDfile
Find this compound or compounds like it in BindingDB:
Activity Spreadsheet -- Enzyme Inhibition Constant Data from BindingDB
Found 2 hits for monomerid = 50225352
LigandPNGBDBM50225352(CHEMBL285455)
Affinity DataKi:  320nM. Assay description: Binding affinity towards alpha-2 adrenergic receptor in rat using [3H]rauwolscine as radioligand
In DepthDetails ArticlePubMed
TargetAlpha-1A/Alpha-1B/Alpha-1D adrenergic receptor(Rattus norvegicus (rat))
TBA
Curated by ChEMBL
LigandPNGBDBM50225352(CHEMBL285455)
Affinity DataKi:  3.60E+3nM. Assay description: Binding affinity against alpha-1 adrenergic receptor in rat using [3H]prazosin as radioligand
In DepthDetails ArticlePubMed