BDBM50226175 But-2-enoic acid amide::CHEMBL58562
SMILES C\C=C\C(N)=O
InChI Key InChIKey=NQQRXZOPZBKCNF-NSCUHMNNSA-N
Data  1 KI
  Tab Delimited (TSV)   2D SDfile   Computed 3D by Vconf -m prep SDfile
Find this compound or compounds like it in BindingDB:
Activity Spreadsheet -- Enzyme Inhibition Constant Data from BindingDB
Found 1 hit for monomerid = 50226175
TargetAlcohol dehydrogenase S chain(Equus caballus)
TBA
Curated by ChEMBL
LigandPNGBDBM50226175(But-2-enoic acid amide | CHEMBL58562)
Affinity DataKi:  1.29E+6nM. Assay description: Inhibitory activity against horse liver alcohol dehydrogenase (ADH)
In DepthDetails ArticlePubMed