BDBM50226418 CHEMBL3142313
SMILES [#6]-[#6]-[#8]-c1ccc(-[#6]-[#6@@H]-2-[#7]-[#6](=O)-[#6]C([#16]-[#16]-[#6]-[#6@H](-[#7]-[#6](=O)-[#6@H](-[#6]-[#6](-[#7])=O)-[#7]-[#6](=O)-[#6@@H](-[#7]-[#6](=O)-[#6@H](-[#6]-c3ccccc3)-[#7]-[#6]-2=O)-[#6](-[#6])-[#6])-[#6](=O)-[#7]-[#6@@H](-[#6]-[#6]-[#6]\[#7]=[#6](\[#7])-[#7])-[#6](=O)-[#7]-[#6@@H](-[#6]-[#6]-[#6]\[#7]=[#6](/[#7])-[#7])-[#6](-[#8])=O)([#6]-2-[#6]-[#6]-[#6]-[#6]-2)[#6]-2-[#6]-[#6]-[#6]-[#6]-2)cc1
InChI Key InChIKey=BMLKVCTUWHHDAJ-BZKRTERRSA-N
Data  1 KI
  Tab Delimited (TSV)   2D SDfile   Computed 3D by Vconf -m prep SDfile
Find this compound or compounds like it in BindingDB:
Activity Spreadsheet -- Enzyme Inhibition Constant Data from BindingDB
Found 1 hit for monomerid = 50226418
TargetAdenylate cyclase type 4(Homo sapiens (Human))
Research And Development Division
Curated by ChEMBL
LigandPNGBDBM50226418(CHEMBL3142313)
Affinity DataKi:  7.80nM. Assay description: Binding affinity for dopamine receptor D2 was evaluated by the ability to displace [3H]spiperone
In DepthDetails ArticlePubMed