BDBM50226613 (S)-2-(2-aminoethylamino)-3-(1-phenethyl-1H-imidazol-4-yl)propanoic acid::CHEMBL393395
SMILES NCCN[C@@H](Cc1cn(CCc2ccccc2)cn1)C(O)=O
InChI Key InChIKey=KIBISFXBVFKORC-HNNXBMFYSA-N
Data  1 KI
  Tab Delimited (TSV)   2D SDfile   Computed 3D by Vconf -m prep SDfile
Find this compound or compounds like it in BindingDB:
Activity Spreadsheet -- Enzyme Inhibition Constant Data from BindingDB
Found 1 hit for monomerid = 50226613
TargetCarboxypeptidase B2(Homo sapiens (Human))
Pfizer
Curated by ChEMBL
LigandPNGBDBM50226613((S)-2-(2-aminoethylamino)-3-(1-phenethyl-1H-imidaz...)
Affinity DataKi:  140nM. Assay description: Inhibition of human TAFIa
In DepthDetails ArticlePubMed