BDBM50227501 CHEMBL237711::thiophen-2-ylmethanamine
SMILES NCc1cccs1
InChI Key InChIKey=FKKJJPMGAWGYPN-UHFFFAOYSA-N
Data  1 KI
  Tab Delimited (TSV)   2D SDfile   Computed 3D by Vconf -m prep SDfile
Find this compound or compounds like it in BindingDB:
Activity Spreadsheet -- Enzyme Inhibition Constant Data from BindingDB
Found 1 hit for monomerid = 50227501
TargetPhenylethanolamine N-methyltransferase(Homo sapiens (Human))
The University Of Kansas
Curated by ChEMBL
LigandPNGBDBM50227501(CHEMBL237711 | thiophen-2-ylmethanamine)
Affinity DataKi:  4.50E+5nM. Assay description: Inhibition of human PNMT by radiochemical assay
In DepthDetails ArticlePubMed