BDBM50227903 CHEMBL307722
SMILES CCCCN(CCCC)C(=O)Nc1ccc(C)c(Cl)c1
InChI Key InChIKey=OMASQHUUTHNKFZ-UHFFFAOYSA-N
Data  2 IC50
  Tab Delimited (TSV)   2D SDfile   Computed 3D by Vconf -m prep SDfile
Find this compound or compounds like it in BindingDB:
Activity Spreadsheet -- Enzyme Inhibition Constant Data from BindingDB
Found 2 hits for monomerid = 50227903
TargetSterol O-acyltransferase 1(Homo sapiens (Human))
American Cyanamid
Curated by ChEMBL
LigandPNGBDBM50227903(CHEMBL307722)
Affinity DataIC50:  1.28E+4nM. Assay description: In vitro inhibitory concentration against acyl coenzyme A:cholesterol acyltransferase derived from smooth muscle cells from thoracic aorta of monkeys
In DepthDetails ArticlePubMed
TargetSterol O-acyltransferase 1(Rattus norvegicus)
American Cyanamid
Curated by ChEMBL
LigandPNGBDBM50227903(CHEMBL307722)
Affinity DataIC50:  6.40E+3nM. Assay description: In vitro inhibitory concentration against acyl coenzyme A:cholesterol acyltransferase derived from rat adrenals
In DepthDetails ArticlePubMed