BDBM50227906 CHEMBL74091
SMILES CCCCN(Cc1ccccc1)C(=O)Nc1c(Cl)cc(Cl)cc1Cl
InChI Key InChIKey=MKBAMWBIWZFPAJ-UHFFFAOYSA-N
Data  1 IC50
  Tab Delimited (TSV)   2D SDfile   Computed 3D by Vconf -m prep SDfile
Find this compound or compounds like it in BindingDB:
Activity Spreadsheet -- Enzyme Inhibition Constant Data from BindingDB
Found 1 hit for monomerid = 50227906
TargetSterol O-acyltransferase 1(Homo sapiens (Human))
American Cyanamid
Curated by ChEMBL
LigandPNGBDBM50227906(CHEMBL74091)
Affinity DataIC50:  3.62E+3nM. Assay description: In vitro inhibitory concentration against acyl coenzyme A:cholesterol acyltransferase derived from smooth muscle cells from thoracic aorta of monkeys
In DepthDetails ArticlePubMed